Target
Cathepsin G
Ligand
BDBM113119
Substrate
Meas. Tech.
Cathepsin G Assay
pH
7.2±n/a
Temperature
310.15±n/a K
Ki
700±n/a nM
Comments
extracted
Citation
 Wagberg, FLeonardsson, G Benzoxazinone derivatives for treatment of skin diseases US Patent  US9695194 Publication Date 7/4/2017 
Target
Name:
Cathepsin G
Synonyms:
CATG_HUMAN CTSG
Type:
PROTEIN
Mol. Mass.:
28860.08
Organism:
Homo sapiens (Human)
Description:
ChEMBL_1469016
Residue:
255
  
Inhibitor
Name:
BDBM113119
Synonyms:
US9695194, 6
Type:
Small organic molecule
Emp. Form.:
C18H15NO5
Mol. Mass.:
325.3154
SMILES:
COc1ccccc1-c1nc2cc3OCCCOc3cc2c(=O)o1
: