Target
Serine protease 1
Ligand
BDBM113294
Substrate
Meas. Tech.
Trypsin Assay
pH
7.2±n/a
Temperature
310.15±n/a K
Ki
>10000±n/a nM
Comments
extracted
Citation
 Wagberg, FLeonardsson, G Benzoxazinone derivatives for treatment of skin diseases US Patent  US9695194 Publication Date 7/4/2017 
Target
Name:
Serine protease 1
Synonyms:
Alpha-trypsin chain 1 Beta-trypsin PRSS1 TRP1 TRY1_HUMAN Thrombin & trypsin Trypsin I | Trypsin-1
Type:
Enzyme
Mol. Mass.:
26557.80
Organism:
Homo sapiens (Human)
Description:
P07477
Residue:
247
  
Inhibitor
Name:
BDBM113294
Synonyms:
US9695194, 11
Type:
Small organic molecule
Emp. Form.:
C23H25NO4
Mol. Mass.:
379.4489
SMILES:
CC(C)c1ccc(-c2nc3cc4OCCCOc4cc3c(=O)o2)c(c1)C(C)C
: