Target
Prothrombin
Ligand
BDBM113295
Substrate
Meas. Tech.
Thrombin Assay
pH
8.3±n/a
Temperature
310.15±n/a K
Ki
>10000±n/a nM
Comments
extracted
Citation
 Wagberg, FLeonardsson, G Benzoxazinone derivatives for treatment of skin diseases US Patent  US9695194 Publication Date 7/4/2017 
Target
Name:
Prothrombin
Synonyms:
Activation peptide fragment 1 Coagulation factor II Prothrombin precursor Thrombin heavy chain | Thrombin light chain
Type:
Protein
Mol. Mass.:
70029.57
Organism:
Homo sapiens (Human)
Description:
P00734
Residue:
622
  
Inhibitor
Name:
BDBM113295
Synonyms:
US9695194, 12
Type:
Small organic molecule
Emp. Form.:
C17H15NO4S
Mol. Mass.:
329.37
SMILES:
COc1cc2nc(oc(=O)c2cc1OC)-c1ccccc1SC
: