Target
Interleukin-1 receptor-associated kinase 4
Ligand
BDBM278827
Substrate
Meas. Tech.
IRAK4 Kinase Assay
pH
7.2±n/a
IC50
17.0±n/a nM
Comments
extracted
Citation
 Lim, JAltman, MDGibeau, CR Thienopyrazine inhibitors of IRAK4 activity US Patent  US10040802 Publication Date 8/7/2018 
Target
Name:
Interleukin-1 receptor-associated kinase 4
Synonyms:
IRAK-4 IRAK4_HUMAN Interleukin-1 receptor-associated kinase 4 (IRAK4) | Renal carcinoma antigen NY-REN-64
Type:
Protein
Mol. Mass.:
51519.08
Organism:
Homo sapiens (Human)
Description:
Q9NWZ3
Residue:
460
  
Inhibitor
Name:
BDBM278827
Synonyms:
2-(1,4-diazepan-1-yl)- N-[1-methyl-3- (trifluoromethyl)-1H- pyrazol-4-yl] thieno[2,3-b] pyrazine-7- carboxamide | US10040802, Example 6
Type:
Small organic molecule
Emp. Form.:
C17H18F3N7OS
Mol. Mass.:
425.431
SMILES:
Cn1cc(NC(=O)c2csc3ncc(nc23)N2CCCNCC2)c(n1)C(F)(F)F
: