Target
Interleukin-1 receptor-associated kinase 4
Ligand
BDBM278894
Substrate
Meas. Tech.
IRAK4 Kinase Assay
pH
7.2±n/a
IC50
1587±n/a nM
Comments
extracted
Citation
 Lim, JAltman, MDGibeau, CR Thienopyrazine inhibitors of IRAK4 activity US Patent  US10040802 Publication Date 8/7/2018 
Target
Name:
Interleukin-1 receptor-associated kinase 4
Synonyms:
IRAK-4 IRAK4_HUMAN Interleukin-1 receptor-associated kinase 4 (IRAK4) | Renal carcinoma antigen NY-REN-64
Type:
Protein
Mol. Mass.:
51519.08
Organism:
Homo sapiens (Human)
Description:
Q9NWZ3
Residue:
460
  
Inhibitor
Name:
BDBM278894
Synonyms:
2-(1,4-diazepan-1-yl)- N-[2-(trifluoromethyl) thiophen-3-yl] thieno[2,3-b] pyrazine-7- carboxamide trifluoroacetate | US10040802, Example 73
Type:
Small organic molecule
Emp. Form.:
C19H17F6N5O3S2
Mol. Mass.:
541.49
SMILES:
OC(=O)C(F)(F)F.FC(F)(F)c1sccc1NC(=O)c1csc2ncc(nc12)N1CCCNCC1
: