Target
DNA dC->dU-editing enzyme APOBEC-3A
Ligand
BDBM91533
Substrate
Meas. Tech.
SAR analysis of small molecule inhibitors of APOBEC3A DNA Deaminase via a fluorescence-based single-stranded DNA deaminase assay - Set 2
Temperature
298.15±n/a K
IC50
>99000±n/a nM
Comments
extracted
Citation
 PubChem, PC SAR analysis of small molecule inhibitors of APOBEC3A DNA Deaminase via a fluorescence-based single-stranded DNA deaminase assay - Set 2 PubChem Bioassay (2012)[AID] 
Target
Name:
DNA dC->dU-editing enzyme APOBEC-3A
Synonyms:
ABC3A_HUMAN probable DNA dC->dU-editing enzyme APOBEC-3A
Type:
Enzyme Catalytic Domain
Mol. Mass.:
23013.77
Organism:
Homo sapiens (Human)
Description:
gi_21955158
Residue:
199
  
Inhibitor
Name:
BDBM91533
Synonyms:
MLS-0471509.0001 | cid_3791782
Type:
Small organic molecule
Emp. Form.:
C14H16N4S2
Mol. Mass.:
304.434
SMILES:
CCc1nc2sc3CCCCc3c2c2nnc(SC)n12
: