Target
Tyrosine-protein phosphatase non-receptor type 5
Ligand
BDBM88748
Substrate
Meas. Tech.
Dose response orthogonal assay of uHTS small molecule inhibitors of Striatal-Enriched Phosphatase via a colorimetric intensity assay.
IC50
>80000±n/a nM
Citation
 PubChem, PC Dose response orthogonal assay of uHTS small molecule inhibitors of Striatal-Enriched Phosphatase via a colorimetric intensity assay. PubChem Bioassay (2012)[AID] 
Target
Name:
Tyrosine-protein phosphatase non-receptor type 5
Synonyms:
PTN5_HUMAN Tyrosine-protein phosphatase non-receptor type 5 | Tyrosine-protein phosphatase non-receptor type 5 isoform a
Type:
Enzyme Catalytic Domain
Mol. Mass.:
63510.68
Organism:
Homo sapiens (Human)
Description:
gi_90652859
Residue:
565
  
Inhibitor
Name:
BDBM88748
Synonyms:
3-(3-chloranyl-4-methoxy-phenyl)-1-[3-(4-methylpiperidin-1-yl)propyl]-1-(thiophen-2-ylmethyl)thiourea 3-(3-chloro-4-methoxyphenyl)-1-[3-(4-methyl-1-piperidinyl)propyl]-1-(thiophen-2-ylmethyl)thiourea MLS000729725 SMR000308002 | cid_16188102
Type:
Small organic molecule
Emp. Form.:
C22H30ClN3OS2
Mol. Mass.:
452.076
SMILES:
COc1ccc(NC(=S)N(CCCN2CCC(C)CC2)Cc2cccs2)cc1Cl
: