Target
Tyrosine-protein phosphatase non-receptor type 5
Ligand
BDBM82783
Substrate
Meas. Tech.
Dose response orthogonal assay of uHTS small molecule inhibitors of Striatal-Enriched Phosphatase via a colorimetric intensity assay.
IC50
>80000±n/a nM
Citation
 PubChem, PC Dose response orthogonal assay of uHTS small molecule inhibitors of Striatal-Enriched Phosphatase via a colorimetric intensity assay. PubChem Bioassay (2012)[AID] 
Target
Name:
Tyrosine-protein phosphatase non-receptor type 5
Synonyms:
PTN5_HUMAN Tyrosine-protein phosphatase non-receptor type 5 | Tyrosine-protein phosphatase non-receptor type 5 isoform a
Type:
Enzyme Catalytic Domain
Mol. Mass.:
63510.68
Organism:
Homo sapiens (Human)
Description:
gi_90652859
Residue:
565
  
Inhibitor
Name:
BDBM82783
Synonyms:
3-[ethyl(phenyl)sulfamoyl]-4-methyl-benzoic acid [2-(2,3-dihydro-1,4-benzodioxin-6-ylamino)-2-keto-1-methyl-ethyl] ester MLS000394788 [1-(2,3-dihydro-1,4-benzodioxin-6-ylamino)-1-oxidanylidene-propan-2-yl] 3-[ethyl(phenyl)sulfamoyl]-4-methyl-benzoate cid_5204584
Type:
Small organic molecule
Emp. Form.:
C27H28N2O7S
Mol. Mass.:
524.585
SMILES:
CCN(c1ccccc1)S(=O)(=O)c1cc(ccc1C)C(=O)OC(C)C(=O)Nc1ccc2OCCOc2c1
: