Target
Tyrosine-protein phosphatase non-receptor type 5
Ligand
BDBM88790
Substrate
Meas. Tech.
Dose response orthogonal assay of uHTS small molecule inhibitors of Striatal-Enriched Phosphatase via a colorimetric intensity assay.
IC50
>80000±n/a nM
Citation
 PubChem, PC Dose response orthogonal assay of uHTS small molecule inhibitors of Striatal-Enriched Phosphatase via a colorimetric intensity assay. PubChem Bioassay (2012)[AID] 
Target
Name:
Tyrosine-protein phosphatase non-receptor type 5
Synonyms:
PTN5_HUMAN Tyrosine-protein phosphatase non-receptor type 5 | Tyrosine-protein phosphatase non-receptor type 5 isoform a
Type:
Enzyme Catalytic Domain
Mol. Mass.:
63510.68
Organism:
Homo sapiens (Human)
Description:
gi_90652859
Residue:
565
  
Inhibitor
Name:
BDBM88790
Synonyms:
4-[({[(2E)-3-(4-chlorophenyl)prop-2-enoyl]amino}carbonothioyl)amino]benzoic acid 4-[[(E)-3-(4-chlorophenyl)prop-2-enoyl]carbamothioylamino]benzoic acid MLS001196128 cid_1329095
Type:
Small organic molecule
Emp. Form.:
C17H13ClN2O3S
Mol. Mass.:
360.815
SMILES:
OC(=O)c1ccc(NC(=S)NC(=O)C=Cc2ccc(Cl)cc2)cc1
: