Target
Tyrosine-protein phosphatase non-receptor type 5
Ligand
BDBM60868
Substrate
Meas. Tech.
Dose response orthogonal assay of uHTS small molecule inhibitors of Striatal-Enriched Phosphatase via a colorimetric intensity assay.
IC50
31900±n/a nM
Citation
 PubChem, PC Dose response orthogonal assay of uHTS small molecule inhibitors of Striatal-Enriched Phosphatase via a colorimetric intensity assay. PubChem Bioassay (2012)[AID] 
Target
Name:
Tyrosine-protein phosphatase non-receptor type 5
Synonyms:
PTN5_HUMAN Tyrosine-protein phosphatase non-receptor type 5 | Tyrosine-protein phosphatase non-receptor type 5 isoform a
Type:
Enzyme Catalytic Domain
Mol. Mass.:
63510.68
Organism:
Homo sapiens (Human)
Description:
gi_90652859
Residue:
565
  
Inhibitor
Name:
BDBM60868
Synonyms:
2,3-bis(sulfanyl)butanedioic acid 2,3-dimercaptosuccinic acid SMR000499575 meso-2,3-Dimercaptosuccinic acid
Type:
Small organic molecule
Emp. Form.:
C4H6O4S2
Mol. Mass.:
182.218
SMILES:
OC(=O)C(S)C(S)C(O)=O
: