Target
Tyrosine-protein phosphatase non-receptor type 22
Ligand
BDBM82604
Substrate
Meas. Tech.
Dose Response selectivity of inhibitors of STriatal-Enriched Phosphatase (STEP) in the Lymphoid Phosphatase (PTPN22) Inhibition Assay
IC50
67652±1900 nM
Citation
 PubChem, PC Dose Response selectivity of inhibitors of STriatal-Enriched Phosphatase (STEP) in the Lymphoid Phosphatase (PTPN22) Inhibition Assay PubChem Bioassay (2012)[AID] 
Target
Name:
Tyrosine-protein phosphatase non-receptor type 22
Synonyms:
3.1.3.48 LyP Lymphoid phosphatase (Lyp) PEST-domain phosphatase PTPN22 Tyrosine-protein phosphatase non-receptor type 22 (LYP) | tyrosine-protein phosphatase non-receptor type 22 isoform 1
Type:
Mol. Mass.:
91712.31
Organism:
Homo sapiens (Human)
Description:
Q9Y2R2
Residue:
807
  
Inhibitor
Name:
BDBM82604
Synonyms:
4-(dimethylamino)benzoic acid [2-keto-2-(4-sulfamoylanilino)ethyl] ester MLS000054309 [2-oxidanylidene-2-[(4-sulfamoylphenyl)amino]ethyl] 4-(dimethylamino)benzoate cid_2102825
Type:
Small organic molecule
Emp. Form.:
C17H19N3O5S
Mol. Mass.:
377.415
SMILES:
CN(C)c1ccc(cc1)C(=O)OCC(=O)Nc1ccc(cc1)S(N)(=O)=O
: