Target
Tyrosine-protein phosphatase non-receptor type 22
Ligand
BDBM88725
Substrate
Meas. Tech.
Dose Response selectivity of inhibitors of STriatal-Enriched Phosphatase (STEP) in the Lymphoid Phosphatase (PTPN22) Inhibition Assay
IC50
>100000±0 nM
Citation
 PubChem, PC Dose Response selectivity of inhibitors of STriatal-Enriched Phosphatase (STEP) in the Lymphoid Phosphatase (PTPN22) Inhibition Assay PubChem Bioassay (2012)[AID] 
Target
Name:
Tyrosine-protein phosphatase non-receptor type 22
Synonyms:
3.1.3.48 LyP Lymphoid phosphatase (Lyp) PEST-domain phosphatase PTPN22 Tyrosine-protein phosphatase non-receptor type 22 (LYP) | tyrosine-protein phosphatase non-receptor type 22 isoform 1
Type:
Mol. Mass.:
91712.31
Organism:
Homo sapiens (Human)
Description:
Q9Y2R2
Residue:
807
  
Inhibitor
Name:
BDBM88725
Synonyms:
(4-bromophenyl)-[4-(2-hydroxyethyl)-1-piperazinyl]methanethione (4-bromophenyl)-[4-(2-hydroxyethyl)piperazino]methanethione MLS000577024 cid_888623
Type:
Small organic molecule
Emp. Form.:
C13H17BrN2OS
Mol. Mass.:
329.256
SMILES:
OCCN1CCN(CC1)C(=S)c1ccc(Br)cc1
: