Target
Tyrosine-protein phosphatase non-receptor type 22
Ligand
BDBM88787
Substrate
Meas. Tech.
Dose Response selectivity of inhibitors of STriatal-Enriched Phosphatase (STEP) in the Lymphoid Phosphatase (PTPN22) Inhibition Assay
IC50
90715±1790 nM
Citation
 PubChem, PC Dose Response selectivity of inhibitors of STriatal-Enriched Phosphatase (STEP) in the Lymphoid Phosphatase (PTPN22) Inhibition Assay PubChem Bioassay (2012)[AID] 
Target
Name:
Tyrosine-protein phosphatase non-receptor type 22
Synonyms:
3.1.3.48 LyP Lymphoid phosphatase (Lyp) PEST-domain phosphatase PTPN22 Tyrosine-protein phosphatase non-receptor type 22 (LYP) | tyrosine-protein phosphatase non-receptor type 22 isoform 1
Type:
Mol. Mass.:
91712.31
Organism:
Homo sapiens (Human)
Description:
Q9Y2R2
Residue:
807
  
Inhibitor
Name:
BDBM88787
Synonyms:
(2Z)-2-(salicyloylhydrazono)chromene-3-carboxamide (2Z)-2-[(2-hydroxybenzoyl)hydrazono]-2H-chromene-3-carboxamide (2Z)-2-[[(2-hydroxyphenyl)-oxomethyl]hydrazinylidene]-1-benzopyran-3-carboxamide SMR000554966 | cid_9629545
Type:
Small organic molecule
Emp. Form.:
C17H13N3O4
Mol. Mass.:
323.3028
SMILES:
NC(=O)c1cc2ccccc2o\c1=N/NC(=O)c1ccccc1O
: