Target
Deoxyuridine 5'-triphosphate nucleotidohydrolase, mitochondrial
Ligand
BDBM50173530
Substrate
Meas. Tech.
Inhibition Assay
pH
8±0
Temperature
298.15±0 K
Ki
8.05e+5±n/a nM
Citation
 Musso-Buendía, JAVidal, AEKasinthan, GNguyen, CCarrero-Lérida, JRuiz-Pérez, LMWilson, KJohansson, NGGilbert, IHGonzález-Pacanowska, D Kinetic properties and inhibition of the dimeric dUTPase-dUDPase from Campylobacter jejuni. J Enzyme Inhib Med Chem 24:111-6 (2009)  
Target
Name:
Deoxyuridine 5'-triphosphate nucleotidohydrolase, mitochondrial
Synonyms:
DUT Deoxyuridine 5'-triphosphate nucleotidohydrolase (dUTPase) dUTP pyrophosphatase
Type:
Enzyme
Mol. Mass.:
26574.03
Organism:
Homo sapiens (Human)
Description:
P33316
Residue:
252
  
Inhibitor
Name:
BDBM50173530
Synonyms:
1-[5-(tert-Butyl-diphenyl-silanyloxymethyl)-4-hydroxy-tetrahydro-furan-2-yl]-1H-pyrimidine-2,4-dione dUTPase inhibitor, 9
Type:
Small organic molecule
Emp. Form.:
C25H30N2O5Si
Mol. Mass.:
466.6016
SMILES:
CC(C)(C)[Si](OCC1OC(CC1O)n1ccc(=O)[nH]c1=O)(c1ccccc1)c1ccccc1
: