Target
dCTP deaminase
Ligand
BDBM50173566
Substrate
Meas. Tech.
Inhibition Assay
pH
8±0
Temperature
298.15±0 K
Ki
1.000000e+9±n/a nM
Citation
 Musso-Buendía, JAVidal, AEKasinthan, GNguyen, CCarrero-Lérida, JRuiz-Pérez, LMWilson, KJohansson, NGGilbert, IHGonzález-Pacanowska, D Kinetic properties and inhibition of the dimeric dUTPase-dUDPase from Campylobacter jejuni. J Enzyme Inhib Med Chem 24:111-6 (2009)  
Target
Name:
dCTP deaminase
Synonyms:
DCD_CAMJE dcd
Type:
Protein
Mol. Mass.:
20698.65
Organism:
Campylobacter jejuni
Description:
Residue:
186
  
Inhibitor
Name:
BDBM50173566
Synonyms:
1-(4-Hydroxy-5-triisopropylsilanyloxymethyl-tetrahydro-furan-2-yl)-1H-pyrimidine-2,4-dione dUTPase inhibitor, 10
Type:
Small organic molecule
Emp. Form.:
C18H32N2O5Si
Mol. Mass.:
384.5426
SMILES:
CC(C)[Si](OCC1OC(CC1O)n1ccc(=O)[nH]c1=O)(C(C)C)C(C)C
: