Target
Tyrosine-protein kinase BTK
Ligand
BDBM278853
Substrate
Meas. Tech.
Btk Enzyme Activity Assay
IC50
0.610±n/a nM
Citation
 Liu, JKozlowski, JAGao, XGuiadeen, DGLiu, SWang, D Substituted imidazo[1,5-a]pyrazines as Btk inhibitors US Patent  US10040805 Publication Date 8/7/2018 
Target
Name:
Tyrosine-protein kinase BTK
Synonyms:
AGMX1 Agammaglobulinaemia tyrosine kinase B cell progenitor kinase BPK BTK_HUMAN Tyrosine Kinase BTK Tyrosine-protein kinase BTK (BTK)
Type:
Enzyme
Mol. Mass.:
76289.95
Organism:
Homo sapiens (Human)
Description:
Q06187
Residue:
659
  
Inhibitor
Name:
BDBM278853
Synonyms:
4-{8-amino-3- [(6S,8aR)-6-methyl-3- oxohexahydro[1,3] oxazolo[3,4-a]pyridin- 6-yl]limidazo[1,5-a] pyrazin-1-yl}-3- ethoxy-N-[4- (trifluoromethyl) pyridin-2-yl] benzamide | US10040805, Example 1
Type:
Small organic molecule
Emp. Form.:
C29H28F3N7O4
Mol. Mass.:
595.5723
SMILES:
CCOc1cc(ccc1-c1nc(n2ccnc(N)c12)[C@@]1(C)CC[C@@H]2COC(=O)N2C1)C(=O)Nc1cc(ccn1)C(F)(F)F
: