Target
Tyrosine-protein kinase BTK
Ligand
BDBM278941
Substrate
Meas. Tech.
Btk Enzyme Activity Assay
IC50
0.590±n/a nM
Citation
 Liu, JKozlowski, JAGao, XGuiadeen, DGLiu, SWang, D Substituted imidazo[1,5-a]pyrazines as Btk inhibitors US Patent  US10040805 Publication Date 8/7/2018 
Target
Name:
Tyrosine-protein kinase BTK
Synonyms:
AGMX1 Agammaglobulinaemia tyrosine kinase B cell progenitor kinase BPK BTK_HUMAN Tyrosine Kinase BTK Tyrosine-protein kinase BTK (BTK)
Type:
Enzyme
Mol. Mass.:
76289.95
Organism:
Homo sapiens (Human)
Description:
Q06187
Residue:
659
  
Inhibitor
Name:
BDBM278941
Synonyms:
4-{8-amino-3- [(6R,8aS)-6-methyl-3- oxohexahydro[1,3] oxazolo[3,4-a]pyridin-6- yl]imidazo[1,5- a]pyrazin-1-yl}-3- ethoxy-5-fluoro-N-[4- (trifluoromethyl) pyridin-2-yl] benzamide | US10040805, Example 11
Type:
Small organic molecule
Emp. Form.:
C29H27F4N7O4
Mol. Mass.:
613.5628
SMILES:
CCOc1cc(cc(F)c1-c1nc(n2ccnc(N)c12)[C@]1(C)CC[C@H]2COC(=O)N2C1)C(=O)Nc1cc(ccn1)C(F)(F)F
: