Target
Soluble acetylcholine receptor
Ligand
BDBM50143314
Substrate
Meas. Tech.
Creating an a7 Nicotinic Acetylcholine Recognition Domain from the Acetylcholine-binding Protein
pH
7.4±n/a
Temperature
293.15±n/a K
Ki
7.4±n/a nM
Citation
 Nemecz, AkosTaylor, Palmer  Creating an a7 Nicotinic Acetylcholine Recognition Domain from the Acetylcholine-binding Protein Taylor Research Group 0:0 (2014)   
Target
Name:
Soluble acetylcholine receptor
Synonyms:
Acetylcholine Binding protein | Soluble acetylcholine receptor
Type:
Mol. Mass.:
26560.08
Organism:
Aplysia Californica
Description:
Q8WSF8
Residue:
236
  
Inhibitor
Name:
BDBM50143314
Synonyms:
(+)-Epibatidine (1R,2R,4S)-2-(6-Chloro-pyridin-3-yl)-7-aza-bicyclo[2.2.1]heptane CHEMBL298826 | EPIBATIDINE
Type:
Small organic molecule
Emp. Form.:
C11H13ClN2
Mol. Mass.:
208.687
SMILES:
Clc1ccc(cn1)[C@H]1C[C@@H]2CC[C@H]1N2
: