Target
Glutaminase kidney isoform, mitochondrial
Ligand
BDBM405130
Substrate
Meas. Tech.
Enzymatic Activity Assay
IC50
<100±n/a nM
Citation
 Di Francesco, MEJones, PHeffernan, THamilton, MMKang, ZSoth, MJBurke, JPLe, KCarroll, CLPalmer, WSLewis, RMcAfoos, TCzako, BLiu, GTheroff, JHerrera, ZYau, A GLS1 inhibitors for treating disease US Patent  US10344025 Publication Date 7/9/2019 
Target
Name:
Glutaminase kidney isoform, mitochondrial
Synonyms:
GLS GLSK_HUMAN K-glutaminase L-glutamine amidohydrolase
Type:
Protein
Mol. Mass.:
73471.89
Organism:
Homo sapiens (Human)
Description:
O94925
Residue:
669
  
Inhibitor
Name:
BDBM405130
Synonyms:
1-{2-fluoro-4-[4-({[6- (trifluoromethyl)pyridin-2- yl]methyl}carbamoyl)-1H-1,2,3- triazol-1-yl]butyl}-N-{[4- (trifluoromethyl)pyridin-2-yl]methyl}- 1H-1,2,3-triazole-4-carboxamide US11370786, Example 474
Type:
Small organic molecule
Emp. Form.:
C24H21F7N10O2
Mol. Mass.:
614.4782
SMILES:
FC(CCn1cc(nn1)C(=O)NCc1cccc(n1)C(F)(F)F)Cn1cc(nn1)C(=O)NCc1cc(ccn1)C(F)(F)F
: