Target
Glutaminase kidney isoform, mitochondrial
Ligand
BDBM405201
Substrate
Meas. Tech.
Enzymatic Activity Assay
IC50
<100±n/a nM
Citation
 Di Francesco, MEJones, PHeffernan, THamilton, MMKang, ZSoth, MJBurke, JPLe, KCarroll, CLPalmer, WSLewis, RMcAfoos, TCzako, BLiu, GTheroff, JHerrera, ZYau, A GLS1 inhibitors for treating disease US Patent  US10344025 Publication Date 7/9/2019 
Target
Name:
Glutaminase kidney isoform, mitochondrial
Synonyms:
GLS GLSK_HUMAN K-glutaminase L-glutamine amidohydrolase
Type:
Protein
Mol. Mass.:
73471.89
Organism:
Homo sapiens (Human)
Description:
O94925
Residue:
669
  
Inhibitor
Name:
BDBM405201
Synonyms:
N-methyl-1-[4-(6-{2-[3-(pyridin-2- yl)phenyl]acetamido}pyridazin-3- yl)butyl]-1H-1,2,3-triazole-4- carboxamide US11370786, Example 545
Type:
Small organic molecule
Emp. Form.:
C25H26N8O2
Mol. Mass.:
470.5263
SMILES:
CNC(=O)c1cn(CCCCc2ccc(NC(=O)Cc3cccc(c3)-c3ccccn3)nn2)nn1
: