Target
Cytochrome P450 26A1
Ligand
BDBM91702
Substrate
Meas. Tech.
Cell Assay
EC50
>2.0e+4±0 nM
Citation
 Pautus, SAboraia, ASBassett, CEBrancale, ACoogan, MPSimons, C Design and synthesis of substituted imidazole and triazole N-phenylbenzo[d]oxazolamine inhibitors of retinoic acid metabolizing enzyme CYP26. J Enzyme Inhib Med Chem 24:487-98 (2009)  
Target
Name:
Cytochrome P450 26A1
Synonyms:
CP26A_HUMAN CYP26A1 Cytochrome P450 26A1 P450RAI1 | Retinoic acid 4-hydroxylase
Type:
Enzyme
Mol. Mass.:
56216.16
Organism:
Homo sapiens (Human)
Description:
O43174
Residue:
497
  
Inhibitor
Name:
BDBM91702
Synonyms:
Oxazolamine derivative, 5e
Type:
Small organic molecule
Emp. Form.:
C24H20N4O2
Mol. Mass.:
396.4412
SMILES:
COc1ccc(cc1)C(c1ccc(Nc2nc3ccccc3o2)cc1)n1ccnc1
: