Target
Toll-like receptor 7
Ligand
BDBM278950
Substrate
Meas. Tech.
HEK293-Blue-hTLR-7 Cells Ass
EC50
446000±n/a nM
Citation
 Chen, DFeng, SGao, LLi, CWang, BWang, LYun, HZheng, X 3-substituted 5-amino-6H-thiazolo[4,5-d]pyrimidine-2,7-dione compounds for the treatment and prophylaxis of virus infection US Patent  US10040815 Publication Date 8/7/2018 
Target
Name:
Toll-like receptor 7
Synonyms:
ORF Names:UNQ248/PRO285 TLR7_HUMAN | Toll-like receptor 7 (TLR7)
Type:
Enzyme
Mol. Mass.:
120945.35
Organism:
Homo sapiens (Human)
Description:
Q9NYK1
Residue:
1049
  
Inhibitor
Name:
BDBM278950
Synonyms:
US10040815, Example ANA-122 | US10618929, Example ANA-122
Type:
Small organic molecule
Emp. Form.:
C10H12N4O5S
Mol. Mass.:
300.291
SMILES:
Nc1nc2n([C@@H]3O[C@H](CO)C[C@H]3O)c(=O)sc2c(=O)[nH]1
: