Target
Toll-like receptor 7
Ligand
BDBM278966
Substrate
Meas. Tech.
HEK293-Blue-hTLR-7 Cells Ass
EC50
15000±n/a nM
Citation
 Chen, DFeng, SGao, LLi, CWang, BWang, LYun, HZheng, X 3-substituted 5-amino-6H-thiazolo[4,5-d]pyrimidine-2,7-dione compounds for the treatment and prophylaxis of virus infection US Patent  US10040815 Publication Date 8/7/2018 
Target
Name:
Toll-like receptor 7
Synonyms:
ORF Names:UNQ248/PRO285 TLR7_HUMAN | Toll-like receptor 7 (TLR7)
Type:
Enzyme
Mol. Mass.:
120945.35
Organism:
Homo sapiens (Human)
Description:
Q9NYK1
Residue:
1049
  
Inhibitor
Name:
BDBM278966
Synonyms:
5-Amino-3-[(2R,3R,5S)-5-[(S)-cyclopropyl(hydroxy)methyl]-3-methyl-tetrahydrofuran-2-yl]-6H-thiazolo[4,5-d]pyrimidine-2,7-dione US10618929, Example 30
Type:
Small organic molecule
Emp. Form.:
C14H18N4O4S
Mol. Mass.:
338.382
SMILES:
C[C@@H]1C[C@H](O[C@H]1n1c2nc(N)[nH]c(=O)c2sc1=O)[C@@H](O)C1CC1
: