Target
Toll-like receptor 7
Ligand
BDBM278968
Substrate
Meas. Tech.
HEK293-Blue-hTLR-7 Cells Ass
EC50
67000±n/a nM
Citation
 Chen, DFeng, SGao, LLi, CWang, BWang, LYun, HZheng, X 3-substituted 5-amino-6H-thiazolo[4,5-d]pyrimidine-2,7-dione compounds for the treatment and prophylaxis of virus infection US Patent  US10040815 Publication Date 8/7/2018 
Target
Name:
Toll-like receptor 7
Synonyms:
ORF Names:UNQ248/PRO285 TLR7_HUMAN | Toll-like receptor 7 (TLR7)
Type:
Enzyme
Mol. Mass.:
120945.35
Organism:
Homo sapiens (Human)
Description:
Q9NYK1
Residue:
1049
  
Inhibitor
Name:
BDBM278968
Synonyms:
5-Amino-3-[(2R,3R,5S)-5-(hydroxymethyl)-3-pyrrolidin-1-yl-tetrahydrofuran-2-yl]-6H-thiazolo[4,5-d]pyrimidine-2,7-dione US10618929, Example 32
Type:
Small organic molecule
Emp. Form.:
C14H19N5O4S
Mol. Mass.:
353.397
SMILES:
Nc1nc2n([C@@H]3O[C@H](CO)C[C@H]3N3CCCC3)c(=O)sc2c(=O)[nH]1
: