Target
Soluble acetylcholine receptor
Ligand
BDBM91630
Substrate
Meas. Tech.
Synthesizing Selective Agonists for the ?7 Nicotinic Receptor with in situ Click-Chemistry on Acetylcholine Binding Protein Templates.
pH
7.4±n/a
Temperature
293.15±n/a K
Ki
240±n/a nM
Citation
 Yamauchi, JGGomez, KGrimster, NDufouil, MNemecz, AFotsing, JRHo, KTalley, TTSharpless, KFokin, VVTaylor, P Synthesizing Selective Agonists for the ?7 Nicotinic Receptor with in situ Click-Chemistry on Acetylcholine Binding Protein Templates. Mol Pharmacol 82:687-699 (2014)  
Target
Name:
Soluble acetylcholine receptor
Synonyms:
Acetylcholine Binding protein | Soluble acetylcholine receptor
Type:
Mol. Mass.:
26560.08
Organism:
Aplysia Californica
Description:
Q8WSF8
Residue:
236
  
Inhibitor
Name:
BDBM91630
Synonyms:
15t | alpha7 agonists 15t
Type:
Emp. Form.:
C18H21N5S2
Mol. Mass.:
371.523
SMILES:
CN1[C@H]2CC[C@@H]1C[C@H](C2)n1cc(CSc2nc3ccccc3s2)nn1
: