Target
Cholinesterase
Ligand
BDBM91720
Substrate
Meas. Tech.
Cholinesterase Inhibition Assay
IC50
1.6467e+5± 2.33e+3 nM
Citation
 Al-Aboudi, AOdeh, HKhalid, ANaz, QChoudhary, MI Butyrylcholinesterase inhibitory activity of testosterone and some of its metabolites. J Enzyme Inhib Med Chem 24:553-8 (2009)  
Target
Name:
Cholinesterase
Synonyms:
Acylcholine acylhydrolase Butyrylcholine esterase (BChE) Butyrylcholinesterase (BuChE) CHLE_HUMAN Cholinesterases Pseudocholinesterase
Type:
Homotetramer
Mol. Mass.:
68422.27
Organism:
Homo sapiens (Human)
Description:
P06276
Residue:
602
  
Inhibitor
Name:
BDBM91720
Synonyms:
11alpha-Hydroxyandrost-1,4-dien-3,17-dione, 9
Type:
Small organic molecule
Emp. Form.:
C19H24O3
Mol. Mass.:
300.3921
SMILES:
C[C@]12C[C@@H](O)[C@H]3[C@@H](CCC4=CC(=O)C=C[C@]34C)[C@@H]1CCC2=O
: