Target
Cholinesterase
Ligand
BDBM91725
Substrate
Meas. Tech.
Inhibition Assay
IC50
1.600e+6± 1.83e+4 nM
Citation
 Gholivand, KAbdollahi, MMojahed, FAlizadehgan, AMDehghan, G Acetylcholinesterase/butyrylcholinesterase inhibition activity of some new carbacylamidophosphate derivatives. J Enzyme Inhib Med Chem 24:566-76 (2009)  
Target
Name:
Cholinesterase
Synonyms:
Acylcholine acylhydrolase Butyrylcholine esterase CHLE_MOUSE Pseudocholinesterase
Type:
Protein
Mol. Mass.:
68465.99
Organism:
Mus musculus (Mouse)
Description:
Q03311
Residue:
603
  
Inhibitor
Name:
BDBM91725
Synonyms:
Carbacylamidophosphate, 2a
Type:
Small organic molecule
Emp. Form.:
C7H5BrCl2NO2P
Mol. Mass.:
316.904
SMILES:
ClP(Cl)(=O)NC(=O)c1ccc(Br)cc1
: