Target
UDP-3-O-acyl-N-acetylglucosamine deacetylase
Ligand
BDBM92270
Substrate
Meas. Tech.
Thermofluor
pH
7±n/a
Temperature
298.15±n/a K
Kd
75±n/a nM
Citation
 CSARdock, CD LPXC in CSAR_FULL_RELEASE_3JULY2012 CSAR 1:0 (2012)  
Target
Name:
UDP-3-O-acyl-N-acetylglucosamine deacetylase
Synonyms:
LPXC_AQUAE UDP-3-O-[3-hydroxymyristoyl] N-acetylglucosamine deacetylase lpxC | zinc deacetylase LpxC
Type:
Hydrolase
Mol. Mass.:
32146.02
Organism:
Aquifex aeolicus
Description:
The enzyme was stripped of all metal ions by dialysis against 1.0 mM EDTA in buffer at room temperature. The EDTA was then removed by extensive dialysis against EDTA-free buffer and the enzyme was reconstituted to a 1:1 Zn2+ to LpxC ratio by the addition of ZnSO4.
Residue:
282
  
Inhibitor
Name:
BDBM92270
Synonyms:
CS263
Type:
Emp. Form.:
C17H18N2O4
Mol. Mass.:
314.3358
SMILES:
C[C@@H](O)[C@H](NC(=O)c1ccc(cc1)-c1ccccc1)C(=O)NO
: