Target
Urokinase-type plasminogen activator
Ligand
BDBM50138662
Substrate
Meas. Tech.
Abbott uPA__Urokinase Human - Ki(uM)
pH
7.4±n/a
Temperature
298.15±n/a K
Ki
40±n/a nM
Citation
 CSARdock, CD UROKINASE in CSAR_FULL_RELEASE_3JULY2012 CSAR 1:0 (2012)  
Target
Name:
Urokinase-type plasminogen activator
Synonyms:
PLAU UROK_HUMAN Urokinase-type plasminogen activator (uPA) | Urokinase-type plasminogen activator/surface receptor
Type:
Enzyme
Mol. Mass.:
48528.62
Organism:
Homo sapiens (Human)
Description:
P00749
Residue:
431
  
Inhibitor
Name:
BDBM50138662
Synonyms:
6-Carbamimidoyl-naphthalene-2-carboxylic acid (4-aminomethyl-phenyl)-amide CHEMBL324168 uPa_9
Type:
Small organic molecule
Emp. Form.:
C19H18N4O
Mol. Mass.:
318.3724
SMILES:
NCc1ccc(NC(=O)c2ccc3cc(ccc3c2)C(N)=N)cc1
: