Target
Urokinase-type plasminogen activator
Ligand
BDBM92292
Substrate
Meas. Tech.
Abbott uPA__Urokinase Human - Ki(uM)
pH
7.4±n/a
Temperature
298.15±n/a K
Ki
0.9±n/a nM
Citation
 CSARdock, CD UROKINASE in CSAR_FULL_RELEASE_3JULY2012 CSAR 1:0 (2012)  
Target
Name:
Urokinase-type plasminogen activator
Synonyms:
3.4.21.73 U-plasminogen activator Urokinase Urokinase-type plasminogen activator chain B Urokinase-type plasminogen activator short chain A uPA
Type:
Enzyme
Mol. Mass.:
48528.62
Organism:
Homo sapiens (Human)
Description:
P00749
Residue:
431
  
Inhibitor
Name:
BDBM92292
Synonyms:
uPa_17
Type:
Emp. Form.:
C21H21N5O3
Mol. Mass.:
391.4231
SMILES:
COC(=O)Nc1cc(cc2ccc(cc12)C(N)=N)C(=O)Nc1ccc(CN)cc1
: