Target
Dual specificity calcium/calmodulin-dependent 3',5'-cyclic nucleotide phosphodiesterase 1B
Ligand
BDBM279001
Substrate
Meas. Tech.
PDE1 Inhibition Assay
pH
7.6±n/a
Temperature
298.15±n/a K
IC50
0.110±n/a nM
Comments
extracted
Citation
 Kehler, JJuhl, KMarigo, MVital, PJJessing, MLanggård, MRasmussen, LKClementson, CM 1H-pyrazolo[4,3-b]pyridines as PDE1 inhibitors US Patent  US10034861 Publication Date 7/31/2018 
Target
Name:
Dual specificity calcium/calmodulin-dependent 3',5'-cyclic nucleotide phosphodiesterase 1B
Synonyms:
63 kDa Cam-PDE Calcium/calmodulin-dependent 3',5'-cyclic nucleotide phosphodiesterase 1B PDE1B PDE1B_HUMAN Phosphodiesterase 1B Phosphodiesterase Type 1 (PDE1B) | Phosphodiesterase, PDE1/PDE5
Type:
Enzyme
Mol. Mass.:
61366.51
Organism:
Homo sapiens (Human)
Description:
Residue:
536
  
Inhibitor
Name:
BDBM279001
Synonyms:
5-(2-ethoxy-3-pyridyl)-1-isopropyl-3-methyl-N-[(1-methyl-1,2,4-triazol-3-yl)methyl]pyrazolo[4,3-b]pyridin-7-amine US10034861, Example 31 US10766893, Example S31 US11026923, Example 31 US11634416, Example 31
Type:
Small organic molecule
Emp. Form.:
C21H26N8O
Mol. Mass.:
406.4841
SMILES:
CCOc1ncccc1-c1cc(NCc2ncn(C)n2)c2n(nc(C)c2n1)C(C)C
: