Target
Dual specificity calcium/calmodulin-dependent 3',5'-cyclic nucleotide phosphodiesterase 1C
Ligand
BDBM279008
Substrate
Meas. Tech.
PDE1 Inhibition Assay
pH
7.6±n/a
Temperature
298.15±n/a K
IC50
13.0±n/a nM
Comments
extracted
Citation
 Kehler, JJuhl, KMarigo, MVital, PJJessing, MLanggård, MRasmussen, LKClementson, CM 1H-pyrazolo[4,3-b]pyridines as PDE1 inhibitors US Patent  US10034861 Publication Date 7/31/2018 
Target
Name:
Dual specificity calcium/calmodulin-dependent 3',5'-cyclic nucleotide phosphodiesterase 1C
Synonyms:
3',5'-cyclic-AMP phosphodiesterase Calcium/calmodulin-dependent 3',5'-cyclic nucleotide phosphodiesterase 1C Hcam3 PDE1C_HUMAN Phosphodiesterase 1C | Phosphodiesterase, PDE1/PDE5
Type:
Enzyme
Mol. Mass.:
80778.58
Organism:
Homo sapiens (Human)
Description:
Q14123
Residue:
709
  
Inhibitor
Name:
BDBM279008
Synonyms:
5-(2-ethoxy-3-pyridyl)-1-isopropyl-3-methyl-N-[(5-methyloxazol-2-yl)methyl]pyrazolo[4,3-b]pyridin-7-amine US10512632, Example 38 US10806718, Example 38 US11491140, Example 38 | US11634416, Example 38
Type:
Small organic molecule
Emp. Form.:
C22H26N6O2
Mol. Mass.:
406.4808
SMILES:
CCOc1ncccc1-c1cc(NCc2ncc(C)o2)c2n(nc(C)c2n1)C(C)C
: