Target
Dual specificity calcium/calmodulin-dependent 3',5'-cyclic nucleotide phosphodiesterase 1B
Ligand
BDBM279020
Substrate
Meas. Tech.
PDE1 Inhibition Assay
pH
7.6±n/a
Temperature
298.15±n/a K
IC50
0.500±n/a nM
Comments
extracted
Citation
 Kehler, JJuhl, KMarigo, MVital, PJJessing, MLanggård, MRasmussen, LKClementson, CM 1H-pyrazolo[4,3-b]pyridines as PDE1 inhibitors US Patent  US10034861 Publication Date 7/31/2018 
Target
Name:
Dual specificity calcium/calmodulin-dependent 3',5'-cyclic nucleotide phosphodiesterase 1B
Synonyms:
63 kDa Cam-PDE Calcium/calmodulin-dependent 3',5'-cyclic nucleotide phosphodiesterase 1B PDE1B PDE1B_HUMAN Phosphodiesterase 1B Phosphodiesterase Type 1 (PDE1B) | Phosphodiesterase, PDE1/PDE5
Type:
Enzyme
Mol. Mass.:
61366.51
Organism:
Homo sapiens (Human)
Description:
Residue:
536
  
Inhibitor
Name:
BDBM279020
Synonyms:
5-(2-ethoxypyridin-3-yl)-1-isopropyl-3-methyl-N-((4-methyloxazol-2-yl)methyl)-1H-pyrazolo[4,3-b]pyridin-7-amine 2,2,2-trifluoroacetate US10512632, Example 50 US10806718, Example 50 US11491140, Example 50 | US11634416, Example 50
Type:
Small organic molecule
Emp. Form.:
C22H26N6O2
Mol. Mass.:
406.4808
SMILES:
CCOc1ncccc1-c1cc(NCc2nc(C)co2)c2n(nc(C)c2n1)C(C)C
: