Target
Dual specificity calcium/calmodulin-dependent 3',5'-cyclic nucleotide phosphodiesterase 1A
Ligand
BDBM279124
Substrate
Meas. Tech.
PDE1 Inhibition Assay
pH
7.6±n/a
Temperature
298.15±n/a K
IC50
8.20±n/a nM
Comments
extracted
Citation
 Kehler, JJuhl, KMarigo, MVital, PJJessing, MLanggård, MRasmussen, LKClementson, CM 1H-pyrazolo[4,3-b]pyridines as PDE1 inhibitors US Patent  US10034861 Publication Date 7/31/2018 
Target
Name:
Dual specificity calcium/calmodulin-dependent 3',5'-cyclic nucleotide phosphodiesterase 1A
Synonyms:
61 kDa Cam-PDE Cam-PDE 1A PDE1A_HUMAN | hCam-1
Type:
Protein
Mol. Mass.:
61245.69
Organism:
Homo sapiens (Human)
Description:
P54750
Residue:
535
  
Inhibitor
Name:
BDBM279124
Synonyms:
3-[1-isopropyl-3-methyl-7-[(1-methylpyrazol-4-yl)methylamino]pyrazolo[4,3-b]pyridin-5-yl]-4-methyl-oxazolidin-2-one US10512632, Example 155 US10806718, Example 155 US11491140, Example 155 | US11634416, Example 155
Type:
Small organic molecule
Emp. Form.:
C19H25N7O2
Mol. Mass.:
383.4475
SMILES:
CC(C)n1nc(C)c2nc(cc(NCc3cnn(C)c3)c12)N1C(C)COC1=O
: