Target
3-oxo-5-alpha-steroid 4-dehydrogenase 2
Ligand
BDBM92329
Substrate
Meas. Tech.
5Alpha-Reductase Activity Assay
pH
6.5±0
Temperature
310.15±0 K
IC50
13±0.0 nM
Citation
 Bratoeff, ESegura, TRecillas, SCarrizales, EPalacios, AHeuze, ICabeza, M Aromatic esters of progesterone as 5alpha-reductase and prostate growth inhibitors. J Enzyme Inhib Med Chem 24:655-62 (2009)  
Target
Name:
3-oxo-5-alpha-steroid 4-dehydrogenase 2
Synonyms:
3-oxo-5-alpha-steroid 4-dehydrogenase 2 5α-Reductase 2 (5α-R2) SR type 2 Steroid 5-alpha-reductase Type II 5-alpha reductase
Type:
Enzyme
Mol. Mass.:
28406.59
Organism:
Homo sapiens (Human)
Description:
P31213
Residue:
254
  
Inhibitor
Name:
BDBM92329
Synonyms:
Steroid, 10a
Type:
Small organic molecule
Emp. Form.:
C28H34O5
Mol. Mass.:
450.5666
SMILES:
CC(=O)[C@]1(CCC2C3CC[C@@]45O[C@@H]4C(=O)CC[C@]5(C)C3CC[C@]12C)OC(=O)c1ccccc1
: