Target
Serum paraoxonase/arylesterase 1
Ligand
BDBM50174201
Substrate
Meas. Tech.
Paraoxonase Activity Assay
pH
10.5±0
Temperature
298.15±0 K
Ki
805000±0.0 nM
IC50
1639000±0.0 nM
Citation
 Ekinci, DBeydemir, S Effect of some analgesics on paraoxonase-1 purified from human serum. J Enzyme Inhib Med Chem 24:1034-9 (2009)  
Target
Name:
Serum paraoxonase/arylesterase 1
Synonyms:
A-esterase 1 K-45 PON 1 PON1_HUMAN Paraoxonase (hPON1) Serum aryldialkylphosphatase 1 | Serum paraoxonase 1 (PON1)
Type:
Enzyme
Mol. Mass.:
39719.73
Organism:
Homo sapiens (Human)
Description:
P27169
Residue:
355
  
Inhibitor
Name:
BDBM50174201
Synonyms:
ARTHROTEC SOLARAZE US11173137, Compound Diclofenac VOLTAREN-XR sodium 2-(2-(2,6-dichlorophenylamino)phenyl)acetate
Type:
Small organic molecule
Emp. Form.:
C14H10Cl2NO2
Mol. Mass.:
295.141
SMILES:
[O-]C(=O)Cc1ccccc1Nc1c(Cl)cccc1Cl
: