Target
PhoP
Ligand
BDBM50326557
Substrate
Meas. Tech.
Inhibition Assay
IC50
1.2e+4±n/a nM
Citation
 Tang, YTGao, RHavranek, JJGroisman, EAStock, AMMarshall, GR Inhibition of bacterial virulence: drug-like molecules targeting the Salmonella enterica PhoP response regulator. Chem Biol Drug Des 79:1007-17 (2012)  
Target
Name:
PhoP
Synonyms:
Type:
Protein
Mol. Mass.:
24274.92
Organism:
Salmonella enterica
Description:
A6XC03
Residue:
213
  
Inhibitor
Name:
BDBM50326557
Synonyms:
(E)-5-((2-hydroxynaphthalen-1-yl)diazenyl)naphthalene-2-sulfonic acid NSC45576, 2
Type:
Small organic molecule
Emp. Form.:
C20H14N2O4S
Mol. Mass.:
378.401
SMILES:
Oc1ccc2ccccc2c1N=Nc1cccc2cc(ccc12)S(O)(=O)=O
: