Target
Putative glycogen synthase kinase 3 alpha
Ligand
BDBM92346
Substrate
Meas. Tech.
Inhibition Assay
IC50
3.5e+2± 1.0e+2 nM
Citation
 Grütter, CSimard, JRMayer-Wrangowski, SCSchreier, PHPérez-Martí­n, JRichters, AGetlik, MGutbrod, OBraun, CABeck, MERauh, D Targeting GSK3 from Ustilago maydis: Type-II Kinase Inhibitors as Potential Antifungals. ACS Chem Biol 7:1257-67 (2012)  
Target
Name:
Putative glycogen synthase kinase 3 alpha
Synonyms:
Glycogen Synthase Kinase 3 (GSK3)
Type:
Protein
Mol. Mass.:
45420.65
Organism:
Ustilago maydis (Smut fungus)
Description:
A0A0D1CGS9
Residue:
402
  
Inhibitor
Name:
BDBM92346
Synonyms:
GSK3 Inhibitor, 2
Type:
Small organic molecule
Emp. Form.:
C23H26N8O4
Mol. Mass.:
478.5037
SMILES:
CCn1c(nc2cnc(NC(=O)c3ccc(OCCN4CCOCC4)cc3)cc12)-c1nonc1N
: