Target
Putative glycogen synthase kinase 3 alpha
Ligand
BDBM92348
Substrate
Meas. Tech.
Inhibition Assay
IC50
2.4e+3± 2e+2 nM
Citation
 Grütter, CSimard, JRMayer-Wrangowski, SCSchreier, PHPérez-Martí­n, JRichters, AGetlik, MGutbrod, OBraun, CABeck, MERauh, D Targeting GSK3 from Ustilago maydis: Type-II Kinase Inhibitors as Potential Antifungals. ACS Chem Biol 7:1257-67 (2012)  
Target
Name:
Putative glycogen synthase kinase 3 alpha
Synonyms:
Glycogen Synthase Kinase 3 (GSK3)
Type:
Protein
Mol. Mass.:
45420.65
Organism:
Ustilago maydis (Smut fungus)
Description:
A0A0D1CGS9
Residue:
402
  
Inhibitor
Name:
BDBM92348
Synonyms:
1,4-Hybrid, 6
Type:
Small organic molecule
Emp. Form.:
C34H40N10O2
Mol. Mass.:
620.7472
SMILES:
CN(C)CCCC(=O)Nc1ccc2ncnc(Nc3ccc(NC(=O)Nc4cc(nn4-c4cccc(N)c4)C(C)(C)C)cc3)c2c1
: