Target
Neuronal acetylcholine receptor subunit alpha-7
Ligand
BDBM50088438
Substrate
Meas. Tech.
Radioligand Competition Assay
Ki
136±20 nM
Citation
 Rohde, LAAhring, PKJensen, MLNielsen, EØPeters, DHelgstrand, CKrintel, CHarpsøe, KGajhede, MKastrup, JSBalle, T Intersubunit bridge formation governs agonist efficacy at nicotinic acetylcholine α4β2 receptors: unique role of halogen bonding revealed. J Biol Chem 287:4248-59 (2012)  
Target
Name:
Neuronal acetylcholine receptor subunit alpha-7
Synonyms:
ACHA7_RAT Cholinergic, Nicotinic Alpha7 Chrna7 Neuronal acetylcholine receptor (alpha7 nAChR) Neuronal acetylcholine receptor subunit alpha-7 Neuronal acetylcholine receptor subunit alpha-7 (nAChR)
Type:
Enzyme
Mol. Mass.:
56502.44
Organism:
Rattus norvegicus (Rat)
Description:
Q05941
Residue:
502
  
Inhibitor
Name:
BDBM50088438
Synonyms:
1-(pyridin-3-yl)-1,4-diazepane CHEMBL71085 | NS3531, 1
Type:
Small organic molecule
Emp. Form.:
C10H15N3
Mol. Mass.:
177.2462
SMILES:
C1CNCCN(C1)c1cccnc1
: