Target
Neuronal acetylcholine receptor subunit alpha-4
Ligand
BDBM92377
Substrate
Meas. Tech.
Radioligand Competition Assay
Ki
0.62±0.09 nM
Citation
 Rohde, LAAhring, PKJensen, MLNielsen, EØPeters, DHelgstrand, CKrintel, CHarpsøe, KGajhede, MKastrup, JSBalle, T Intersubunit bridge formation governs agonist efficacy at nicotinic acetylcholine α4β2 receptors: unique role of halogen bonding revealed. J Biol Chem 287:4248-59 (2012)  
Target
Name:
Neuronal acetylcholine receptor subunit alpha-4
Synonyms:
ACHA4_RAT Cholinergic, Nicotinic Alpha4Beta2 Chrna4 Neuronal acetylcholine receptor (alpha4beta2 nAChR) Neuronal acetylcholine receptor subunit alpha 4 beta 2 | Neuronal acetylcholine receptor subunit alpha-4
Type:
Enzyme
Mol. Mass.:
70196.44
Organism:
Rattus norvegicus (Rat)
Description:
P09483
Residue:
630
  
Inhibitor
Name:
BDBM92377
Synonyms:
NS3573, 2
Type:
Small organic molecule
Emp. Form.:
C12H19N3O
Mol. Mass.:
221.2988
SMILES:
CCOc1cncc(c1)N1CCCNCC1
: