Target
Bifunctional ligase/repressor BirA
Ligand
BDBM92381
Substrate
Meas. Tech.
Enzyme Inhibition Assay
Ki
>1.0e+4±n/a nM
Citation
 Soares da Costa, TPTieu, WYap, MYPendini, NRPolyak, SWSejer Pedersen, DMorona, RTurnidge, JDWallace, JCWilce, MCBooker, GWAbell, AD Selective inhibition of biotin protein ligase from Staphylococcus aureus. J Biol Chem 287:17823-32 (2012)  
Target
Name:
Bifunctional ligase/repressor BirA
Synonyms:
Biotin ligase | Biotin protein ligase (BPL)
Type:
Protein
Mol. Mass.:
37140.09
Organism:
Staphylococcus aureus
Description:
W8TTE7
Residue:
323
  
Inhibitor
Name:
BDBM92381
Synonyms:
Biotin triazole, 12
Type:
Small organic molecule
Emp. Form.:
C26H33N5O2S
Mol. Mass.:
479.638
SMILES:
O=C1NC2CS[C@@H](CCCCCc3cn(CCCCOc4cccc5ccccc45)nn3)C2N1
: