Target
5-hydroxytryptamine receptor 3A
Ligand
BDBM92432
Substrate
Meas. Tech.
FMP Assay (Cell Assay)
pH
7.4±0
Temperature
310.15±0 K
IC50
>1.00e+5±n/a nM
Citation
 Trattnig, SMHarpsøe, KThygesen, SBRahr, LMAhring, PKBalle, TJensen, AA Discovery of a Novel Allosteric Modulator of 5-HT3 Receptors: INHIBITION AND POTENTIATION OF CYS-LOOP RECEPTOR SIGNALING THROUGH A CONSERVED TRANSMEMBRANE INTERSUBUNIT SITE. J Biol Chem 287:25241-54 (2012)  
Target
Name:
5-hydroxytryptamine receptor 3A
Synonyms:
5-HT-3 5-HT3A 5-hydroxytryptamine receptor 3 (5-HT3) 5-hydroxytryptamine receptor 3A (5HT3A) 5HT3R HTR3A Serotonin 3 receptor (5HT3) Serotonin-gated ion channel receptor | Serotonin-gated ion channel receptor 3
Type:
Protein
Mol. Mass.:
55283.27
Organism:
Homo sapiens (Human)
Description:
P46098
Residue:
478
  
Inhibitor
Name:
BDBM92432
Synonyms:
TH10
Type:
Small organic molecule
Emp. Form.:
C15H12N2OS2
Mol. Mass.:
300.399
SMILES:
CC(=O)CSc1ncnc2sc(cc12)-c1ccccc1
: