Target
Matrix metalloproteinase-14
Ligand
BDBM92446
Substrate
Meas. Tech.
Enzyme Assay
pH
6.8±0
Temperature
298.15±0 K
Ki
968±0.0 nM
Citation
 Devel, LBeau, FAmoura, MVera, LCassar-Lajeunesse, EGarcia, SCzarny, BStura, EADive, V Simple Pseudo-dipeptides with a P2' Glutamate: A NOVEL INHIBITOR FAMILY OF MATRIX METALLOPROTEASES AND OTHER METZINCINS. J Biol Chem 287:26647-56 (2012)  
Target
Name:
Matrix metalloproteinase-14
Synonyms:
MMP-14 MMP14 MT-MMP 1 MT1MMP Matrix Metalloproteinase-14 (MMP-14) Matrix metalloproteinase-14 Membrane-type matrix metalloproteinase 1 | Membrane-type-1 matrix metalloproteinase
Type:
Protein
Mol. Mass.:
65900.19
Organism:
Homo sapiens (Human)
Description:
P50281
Residue:
582
  
Inhibitor
Name:
BDBM92446
Synonyms:
Inhibitor, 16
Type:
Small organic molecule
Emp. Form.:
C22H20N2O4S
Mol. Mass.:
408.47
SMILES:
NC(=O)[C@H](CCC(O)=O)NC(=O)c1ccc(cc1)-c1cc(cs1)-c1ccccc1
: