Target
Phosphoethanolamine N-methyltransferase 1
Ligand
BDBM50034220
Substrate
Meas. Tech.
Radiochemical Assay
pH
8±0
Temperature
298.15±0 K
IC50
1.252e+5± 8.8e+3 nM
Citation
 Lee, SGHaakenson, WMcCarter, JPWilliams, DJHresko, MCJez, JM Thermodynamic evaluation of ligand binding in the plant-like phosphoethanolamine methyltransferases of the parasitic nematode Haemonchus contortus. J Biol Chem 286:38060-8 (2011)  
Target
Name:
Phosphoethanolamine N-methyltransferase 1
Synonyms:
Phosphoehtnaolamine Methyltransferases 1 (PMT1)
Type:
Enzyme
Mol. Mass.:
53531.36
Organism:
Caenorhabditis elegans
Description:
Q86NB3
Residue:
460
  
Inhibitor
Name:
BDBM50034220
Synonyms:
2-(((Hexadecyloxy)hydroxyphosphinyl)oxy)-N,N,N-trimethylethanaminium hydroxide MILTEFOSINE hexadecyl 2-(trimethyl-lambda~5~-azanyl)ethyl hydrogen phosphate hexadecyloxy-2-trimethylammonioethylphosphorate hexadecylphosphocholine, miltefosine | n-hexadecylphosphocholine
Type:
Small organic molecule
Emp. Form.:
C21H46NO4P
Mol. Mass.:
407.568
SMILES:
CCCCCCCCCCCCCCCCOP([O-])(=O)OCC[N+](C)(C)C
: