Target
Phosphoethanolamine N-methyltransferase 1
Ligand
BDBM28422
Substrate
Meas. Tech.
Calorimetric (ITC) Assay
pH
7.5±0
Temperature
278.15±0 K
Kd
6.1e+3± 5e+2 nM
Citation
 Lee, SGHaakenson, WMcCarter, JPWilliams, DJHresko, MCJez, JM Thermodynamic evaluation of ligand binding in the plant-like phosphoethanolamine methyltransferases of the parasitic nematode Haemonchus contortus. J Biol Chem 286:38060-8 (2011)  
Target
Name:
Phosphoethanolamine N-methyltransferase 1
Synonyms:
Phosphoehtnaolamine Methyltransferases 1 (PMT1)
Type:
Enzyme
Mol. Mass.:
53531.36
Organism:
Caenorhabditis elegans
Description:
Q86NB3
Residue:
460
  
Inhibitor
Name:
BDBM28422
Synonyms:
(2S)-2-amino-4-({[(2S,3S,4R,5R)-5-(6-amino-9H-purin-9-yl)-3,4-dihydroxyoxolan-2-yl]methyl}(methyl)sulfanylium)butanoate S-Adenosylmethionine [14COOH]AdoMet
Type:
radiolabeled substrate
Emp. Form.:
C15H22N6O5S
Mol. Mass.:
398.437
SMILES:
C[S+](CC[C@H](N)C([O-])=O)C[C@H]1O[C@H]([C@H](O)[C@@H]1O)n1cnc2c(N)ncnc12
: