Target
Phosphoethanolamine N-methyltransferase 2
Ligand
BDBM50308984
Substrate
Meas. Tech.
Calorimetric (ITC) Assay
pH
7.5±0
Temperature
278.15±0 K
Kd
2.0e+3± 2e+2 nM
Citation
 Lee, SGHaakenson, WMcCarter, JPWilliams, DJHresko, MCJez, JM Thermodynamic evaluation of ligand binding in the plant-like phosphoethanolamine methyltransferases of the parasitic nematode Haemonchus contortus. J Biol Chem 286:38060-8 (2011)  
Target
Name:
Phosphoethanolamine N-methyltransferase 2
Synonyms:
Phosphoehtnaolamine Methyltransferases 2 (PMT2)
Type:
Enzyme
Mol. Mass.:
49764.45
Organism:
Caenorhabditis elegans
Description:
Q22993
Residue:
437
  
Inhibitor
Name:
BDBM50308984
Synonyms:
AdoCys S-Adenosylhomocysteine
Type:
Small organic molecule
Emp. Form.:
C14H20N6O5S
Mol. Mass.:
384.411
SMILES:
N[C@H](CCSC[C@@H]1O[C@@H]([C@@H](O)[C@H]1O)n1cnc2c(N)ncnc12)C(O)=O
: