Target
Bifunctional protein GlmU
Ligand
BDBM50365075
Substrate
Meas. Tech.
Inhibition Assay
pH
7.35±0
IC50
>2.00e+5±n/a nM
Citation
 Buurman, ETAndrews, BGao, NHu, JKeating, TALahiri, SOtterbein, LRPatten, ADStokes, SSShapiro, AB In vitro validation of acetyltransferase activity of GlmU as an antibacterial target in Haemophilus influenzae. J Biol Chem 286:40734-42 (2011)  
Target
Name:
Bifunctional protein GlmU
Synonyms:
Bifunctional protein (GlmU) Glucosamine-1-phosphate N-acetyltransferase glmU
Type:
Enzyme
Mol. Mass.:
49417.06
Organism:
Streptococcus pneumoniae
Description:
Q8DQ18
Residue:
459
  
Inhibitor
Name:
BDBM50365075
Synonyms:
CHEMBL1951164 | Sulfonamide, 2
Type:
Small organic molecule
Emp. Form.:
C17H20N2O5S
Mol. Mass.:
364.416
SMILES:
COc1cc(OC)c(cc1NC(C)=O)S(=O)(=O)N(C)c1ccccc1
: