Target
Bifunctional protein GlmU
Ligand
BDBM92472
Substrate
Meas. Tech.
Inhibition Assay
pH
7.35±0
IC50
>2.00e+5±n/a nM
Citation
 Buurman, ETAndrews, BGao, NHu, JKeating, TALahiri, SOtterbein, LRPatten, ADStokes, SSShapiro, AB In vitro validation of acetyltransferase activity of GlmU as an antibacterial target in Haemophilus influenzae. J Biol Chem 286:40734-42 (2011)  
Target
Name:
Bifunctional protein GlmU
Synonyms:
Bifunctional protein (GlmU) Glucosamine-1-phosphate N-acetyltransferase gcaD | glmU
Type:
Enzyme
Mol. Mass.:
48525.06
Organism:
Staphylococcus aureus
Description:
Q5HIH6
Residue:
450
  
Inhibitor
Name:
BDBM92472
Synonyms:
Sulfonamide, 3
Type:
Small organic molecule
Emp. Form.:
C24H25N3O7S
Mol. Mass.:
499.536
SMILES:
COc1cc(OC)c(cc1NC(=O)CCC(O)=O)S(=O)(=O)N(c1ccccc1)c1ccc(N)cc1
: