Target
Genome polyprotein [1027-1206,R1052K]/[1678-1691]
Ligand
BDBM3899
Substrate
NS4B-5A
Meas. Tech.
HCV Protease Inhibition Assay
IC50
490±n/a nM
Citation
 Bailey, MDHalmos, TGoudreau, NLescop, ELlinas-Brunet, M Novel azapeptide inhibitors of hepatitis C virus serine protease. J Med Chem 47:3788-99 (2004)  
Target
Name:
Genome polyprotein [1027-1206,R1052K]/[1678-1691]
Synonyms:
HCV NS3-NS4A Serine Proteinase
Type:
Enzyme and Cofactor
Mol. Mass.:
Description:
Components:
This complex has 2 components.
Component 1
Name:
Genome polyprotein [1027-1206,R1052K]
Synonyms:
HCV NS3 Proteinase POLG_HCVCO
Type:
Enzyme Subunit
Mol. Mass.:
18947.03
Organism:
Hepatitis C virus
Description:
HCV (BK strain) NS3 protein region from amino acid 1 to 180, harboring a C-terminal poly Lys solubilization motif (ASKKKK).
Residue:
180
  
Component 2
Name:
Genome polyprotein [1678-1691]
Synonyms:
HCV NS4A | POLG_HCVJA
Type:
Peptide
Mol. Mass.:
1815.28
Organism:
Description:
NS4A-derived peptide
Residue:
17
KKGSVVIVGRIILSGRK
 
Inhibitor
Name:
BDBM3899
Synonyms:
(4R)-4-{[(1S)-1-{[(2S)-1-[(2S,4R)-4-(benzyloxy)-2-[({[(1S)-1-(naphthalen-1-yl)ethyl]carbamoyl}(propyl)amino)carbamoyl]pyrrolidin-1-yl]-3-methyl-1-oxobutan-2-yl]carbamoyl}-2-methylbutyl]carbamoyl}-4-[(3S)-3-acetamido-3-formamidopropanoic acid]butanoic acid | Azapeptide-based compound 40
Type:
Small organic molecule
Emp. Form.:
C50H68N8O12
Mol. Mass.:
973.1213
SMILES:
CCCN(NC(=O)[C@@H]1C[C@H](CN1C(=O)[C@@H](NC(=O)[C@@H](NC(=O)[C@@H](CCC(O)=O)NC(=O)[C@H](CC(O)=O)NC(C)=O)[C@@H](C)CC)C(C)C)OCc1ccccc1)C(=O)N[C@@H](C)c1cccc2ccccc12
:
Substrate
Name:
NS4B-5A
Synonyms:
Type:
Peptide
Mol. Mass.:
1414.56
Organism:
Description:
NS4B-5A derived peptide
Residue:
12
DDIVPCSMSYTW